{"text_format":"1","workbook":"xlsx","n_sheets":7,"sheets":["Info en versiebeheer","Invoer en Uitvoer","Input and Output","Batch Invoer en Uitvoer","Berekening","Legaliteit","Variabelen"],"not_rendered":{"charts":0,"images":1,"macros":1,"external_links":0,"defined_names":23,"comments":0,"pivot_tables":0},"unopened":[],"bounds":{"document_bytes":16777216,"sheet_cells":100000,"rows_first":2000,"rows_last":500,"rows_between":2000,"halvings":0,"cell_chars":16384,"cell_head_chars":4096},"cells_cut":0,"cells_raw":0,"read":"whole","date_system":"1900"}

{"sheet":"Info en versiebeheer","index":0,"n_rows":47,"n_cols":5,"rows_kept":47,"cut":false,"hidden":true,"merged":[]}
["Info en Versiebeheer"]
[]
["Datum",{"$f":"TODAY()","v":"2024-12-16"}]
["Door","Ferry Goike"]
["Review","Henk van Heuveln"]
["Fondsnaam","PME"]
["Doel van de sheet","Berekening van ANW premies voor werkgevers"]
["Gebaseerd op Pensioenreglement","Pensioenreglement PME 1-1-2025"]
["Datum vaststelling reglement","2025-01-01"]
["Versienummer","1.0"]
[]
["Werkwijze:"]
["Alle werkbladen worden beveiligd"]
["De sheet komt in directory waar alleen Actuariaat schrijfrechten op heeft, rest van TKP heeft alleen leesrechten"]
["De sheet is geschikt vanaf 1-1-2021."]
["In de sheet moet bij de invoer het verzekerd bedrag worden ingevuld."]
["Daarnaast moet er een geboortedatum van de deelnemer/partner worden ingevuld. "]
["De sheet zal d.m.v. de geboortedatum een burgelijke leeftijd op 1 januari, toetreding regeling of ingang relatie berekenen."]
["De sheet berekent de premie voor een heel jaar (het jaar waarin de berekendatum ligt). Daarnaast wordt ook een bedrag berekend in maanden en 4wk. "]
["Op deze manier is het voor de werkgever inzichtelijk wat de ANW-verzekering op jaar/maand/4wk basis aan premie kost."]
["Tabblad \"Variabelen\" bevat de premietarieven en opslagen; dit moet periodiek worden bijgewerkt"]
["N.B. voor de versie van de sheet die op de website komt: alleen tabblad Invoer en Uitvoer zichtbaar maken en legaliteit op 1 zetten."]
["Voor het tabblad Batch Invoer en Uitvoer dient de pensioennummer te worden gevuld"]
["om een berekening te maken voor de deelnemer. Met de knop wordt de batch berekend"]
["Let op! Bij een jaarovergang (nieuwe bedragen) moet ook de macro (Module4) worden aangepast!"]
[]
["Versienummer","Wijzigingen (korte omschrijving van de aanpassing)","Datum","Auteur","Controleur"]
[1,"Aanmaak van een sheet berekening van ANW premies voor werkgevers/werknemers","2021-08-13","Jeroen Achterhof"]
["1.1","Opmaak bedragen, ingangsdatum >= VANDAAG() - 3mnd, delete/print knop","2021-10-08","Jeroen Achterhof"]
[1,"Tarieven en bedragen per 01-01-2022 ingevoerd","2021-12-14","Ferry Goike"]
["1.1 ","Batch tabblad toegevoegd","2022-01-04","Jeroen Achterhof"]
["1.2","Format bedragen aangepast","2002-01-12","Ferry Goike"]
["1.3","Validatie geboortedatum partner aangepast","2022-04-28","Ferry Goike"]
["1.4","Batch invoer aangepast, keuzemogelijkheid periode","2022-05-31","Jeroen Achterhof","Luuk Keizer"]
["1.5","Alle output terug geplaatst","2022-08-02","Jeroen Achterhof","Luuk Keizer"]
["1.6","Nieuwe AOWlftd 67 3 mnd","2022-11-23","Jeroen Achterhof","Patricia Woudstra/Ben Geense"]
["2023 - 1.0","Bedragen en tarieven per 01-01-2023","2022-11-23","Ferry Goike","Patricia Woudstra/Bart van der Kooi"]
["2023 - 1.1","Invoer datum 2023 op batch sheet was niet mogelijk","2023-02-14","Jeroen Achterhof","Patricia Woudstra/Bart van der Kooi"]
["2023 - 1.20","Toevoeging Engelse tabblad Input and Output & Legaliteit aangepast","2023-04-03","Jeffrey Holtrop","Rutger de Boer / Patricia Woudstra"]
["2023 - 1.21","Kolom H tabblad Berekening uitgebreid. Cel E6 tabblad Input and Output naamgeving aangepast.","2023-05-31","Jeffrey Holtrop","Patricia Woudstra"]
{"$rows_left_out":8}
{"sheet":"Invoer en Uitvoer","index":1,"n_rows":20,"n_cols":5,"rows_kept":20,"cut":false,"hidden":false,"merged":[[8,4,9,7],[5,4,5,7]]}
[]
["Invoer:"]
[]
[null,"Ingangsdatum ANW:"]
[null,"Naam deelnemer:"]
[null,"Pensioennr deelnemer:",null,null,"berekening premie Anw-hiaatpensioen 2025"]
[null,"Geboortedatum deelnemer:"]
[null,"Geboortedatum partner:"]
[null,"Verzekerd bedrag:",null,null,{"$f":"\"Voor nieuwe deelnemers zijn er vanaf 1-1-2025 drie ANW-hiaat bedragen te kiezen: € 9.200, € 14.800 en € 20.400\"","v":"Voor nieuwe deelnemers zijn er vanaf 1-1-2025 drie ANW-hiaat bedragen te kiezen: € 9.200, € 14.800 en € 20.400"}]
[]
[]
[]
[]
[]
[]
["Uitvoer:","Brutopremie per jaar:",{"$f":"IFERROR(Berekening!B23*Legaliteit,\"\")","v":""}]
[null,"Brutopremie per maand:",{"$f":"IFERROR(Berekening!B24*Legaliteit,\"\")","v":""}]
[null,"Brutopremie per 4wk:",{"$f":"IFERROR(Berekening!B25*Legaliteit,\"\")","v":""}]
[null,{"$f":"Berekening!A15","v":"factor koopsom (leeftijd partner)"},{"$f":"Berekening!B15","v":0}]
[null,{"$f":"Berekening!A16","v":"factor premie (leeftijd deelnemer)"},{"$f":"Berekening!B16","v":{"$error":"#N/A"}}]

{"sheet":"Input and Output","index":2,"n_rows":20,"n_cols":5,"rows_kept":20,"cut":false,"hidden":false,"merged":[[5,4,5,7],[8,4,9,7]]}
[]
["Input:"]
[]
[null,"Commencement date ANW:"]
[null,"Name participant:"]
[null,"Pension number participant:",null,null,"Calculation premium additional partner pension (Anw gap) 2025"]
[null,"Date of birth participant:"]
[null,"Date of birth partner:"]
[null,"Insured amount:",null,null,{"$f":"\"For new participants there are three Anw gap pension amounts to choose from as of 1-1-2025: € 9,200, € 14,800 and € 20,400\"","v":"For new participants there are three Anw gap pension amounts to choose from as of 1-1-2025: € 9,200, € 14,800 and € 20,400"}]
[]
[]
[]
[]
[]
[]
["Output:","Gross premium per year:",{"$f":"IFERROR(Berekening!H23*Legaliteit,\"\")","v":""}]
[null,"Gross premium per month:",{"$f":"IFERROR(Berekening!H24*Legaliteit,\"\")","v":""}]
[null,"Gross premium per 4 weeks:",{"$f":"IFERROR(Berekening!H25*Legaliteit,\"\")","v":""}]
[null,{"$f":"Berekening!A15","v":"factor koopsom (leeftijd partner)"},{"$f":"Berekening!B15","v":0}]
[null,{"$f":"Berekening!A16","v":"factor premie (leeftijd deelnemer)"},{"$f":"Berekening!B16","v":{"$error":"#N/A"}}]

{"sheet":"Batch Invoer en Uitvoer","index":3,"n_rows":3623,"n_cols":45,"rows_kept":3623,"cut":false,"hidden":true,"merged":[]}
["index","Ingangsdatum ANW","Naam deelnemer","Pensioennr deelnemer","Geboortedatum deelnemer","Geboortedatum partner","Verzekerd bedrag","Periode","Brutopremie per jaar","Brutopremie per periode","Brutopremie per 4wk","factor koopsom (leeftijd partner)","factor premie (leeftijd deelnemer)",null,"Brutopremie per jaar (Verzekerd bedrag €9,200)","Brutopremie per jaar (Verzekerd bedrag €14,800)","Brutopremie per jaar (Verzekerd bedrag €20,400)","Brutopremie per maand (Verzekerd bedrag €9,200)","Brutopremie per maand (Verzekerd bedrag €14,800)","Brutopremie per maand (Verzekerd bedrag €20,400)","Brutopremie per 4wk (Verzekerd bedrag €9,200)","Brutopremie per 4wk (Verzekerd bedrag €14,800)","Brutopremie per 4wk (Verzekerd bedrag €20,400)",null,null,null,null,null,null,null,null,null,null,null,null,null,null,null,{"$f":"MAX(A:A)","v":0},null,"Brutopremie per jaar","Brutopremie per periode","Brutopremie per 4wk","factor koopsom (leeftijd partner)","factor premie (leeftijd deelnemer)"]
[]
[]
[{"$f":"IF(D4=\"\",\"\",A3+1)","v":""},null,null,null,null,null,null,null,{"$f":"IF(AO4=0,\"\",AO4)","v":""},{"$f":"IF(I4=\"\",\"\",IF(H4=\"4-week\",AQ4,AP4))","v":""},8.4827076923076916,{"$f":"IF(AR4=0,\"\",AR4)","v":""},{"$f":"IF(AS4=0,\"\",AS4)","v":""},"Let op! Ongeldige gegevens ingevoerd!",null,null,null,{"$f":"IFERROR(O4/12,0)","v":0},{"$f":"IFERROR(P4/12,0)","v":0},{"$f":"IFERROR(Q4/12,0)","v":0},{"$f":"IFERROR(O4/13,0)","v":0},{"$f":"IFERROR(P4/13,0)","v":0},{"$f":"IFERROR(Q4/13,0)","v":0},null,null,null,null,null,null,null,1]
["",null,null,null,null,null,null,null,{"$f":"IF(AO5=0,\"\",AO5)","v":""},"",168.44888676923074,"","","Let op! Ongeldige gegevens ingevoerd!",null,null,null,0,0,0,0,0,0,null,null,null,null,null,null,null,"1973-08-08"]
["",null,null,null,null,null,null,null,"","",14.630843076923078,"","","Let op! Ongeldige gegevens ingevoerd!",null,null,null,0,0,0,0,0,0,null,null,null,null,null,null,null,"1990-10-09"]
["",null,null,null,null,null,null,null,"","",3.2914326923076924,"","","Let op! Ongeldige gegevens ingevoerd!",null,null,null,0,0,0,0,0,0,null,null,null,null,null,null,null,19000]
["",null,null,null,null,null,null,null,"","",118.50102,"","","Let op! Ongeldige gegevens ingevoerd!",null,null,null,0,0,0,0,0,0]
["",null,null,null,null,null,null,null,"","",5.8949993846153843,"","","Let op! Ongeldige gegevens ingevoerd!",null,null,null,0,0,0,0,0,0]
["",null,null,null,null,null,null,null,"","",24.983675076923074,"","","Let op! Ongeldige gegevens ingevoerd!",null,null,null,0,0,0,0,0,0]
["",null,null,null,null,null,null,null,"","",5.521052307692309,"","","Let op! Ongeldige gegevens ingevoerd!",null,null,null,0,0,0,0,0,0]
["",null,null,null,null,null,null,null,"","",3.9549230769230772,"","","Let op! Ongeldige gegevens ingevoerd!",null,null,null,0,0,0,0,0,0]
["",null,null,null,null,null,null,null,"","",0,"","","Let op! Ongeldige gegevens ingevoerd!",null,null,null,0,0,0,0,0,0]
["",null,null,null,null,null,null,null,"","",3.9549230769230772,"","","Let op! Ongeldige gegevens ingevoerd!",null,null,null,0,0,0,0,0,0]
["",null,null,null,null,null,null,null,"","",3.9549230769230772,"","","Let op! Ongeldige gegevens ingevoerd!",null,null,null,0,0,0,0,0,0]
["",null,null,null,null,null,null,null,"","",3.9549230769230772,"","","Let op! Ongeldige gegevens ingevoerd!",null,null,null,0,0,0,0,0,0]
["",null,null,null,null,null,null,null,"","",3.9549230769230772,"","","Let op! Ongeldige gegevens ingevoerd!",null,null,null,0,0,0,0,0,0]
["",null,null,null,null,null,null,null,"","",3.9549230769230772,"","","Let op! Ongeldige gegevens ingevoerd!",null,null,null,0,0,0,0,0,0]
["",null,null,null,null,null,null,null,"","",3.9549230769230772,"","","Let op! Ongeldige gegevens ingevoerd!",null,null,null,0,0,0,0,0,0]
["",null,null,null,null,null,null,null,"","",0,"","","Let op! Ongeldige gegevens ingevoerd!",null,null,null,0,0,0,0,0,0]
["",null,null,null,null,null,null,null,"","",9.6727107692307683,"","","Let op! Ongeldige gegevens ingevoerd!",null,null,null,0,0,0,0,0,0]
["",null,null,null,null,null,null,null,"","",96.674953846153841,"","","Let op! Ongeldige gegevens ingevoerd!",null,null,null,0,{"$f":"IFERROR(P22/12,0)","v":0},{"$f":"IFERROR(Q22/12,0)","v":0},0,{"$f":"IFERROR(P22/13,0)","v":0},{"$f":"IFERROR(Q22/13,0)","v":0}]
["",null,null,null,null,null,null,null,"","",10.773553846153845,"","","Let op! Ongeldige gegevens ingevoerd!",null,null,null,0,0,0,0,0,0]
["",null,null,null,null,null,null,null,"","",null,"","","Let op! Ongeldige gegevens ingevoerd!",null,null,null,0,0,0,0,0,0]
["",null,null,null,null,null,null,null,"","",null,"","","Let op! Ongeldige gegevens ingevoerd!",null,null,null,0,0,0,0,0,0]
["",null,null,null,null,null,null,null,"","",null,"","","Let op! Ongeldige gegevens ingevoerd!",null,null,null,0,0,0,0,0,0]
["",null,null,null,null,null,null,null,"","",null,"","","Let op! Ongeldige gegevens ingevoerd!",null,null,null,0,0,0,0,0,0]
["",null,null,null,null,null,null,null,"","",null,"","","Let op! Ongeldige gegevens ingevoerd!",null,null,null,0,0,0,0,0,0]
["",null,null,null,null,null,null,null,"","",null,"","","Let op! Ongeldige gegevens ingevoerd!",null,null,null,0,0,0,0,0,0]
["",null,null,null,null,null,null,null,"","",null,"","","Let op! Ongeldige gegevens ingevoerd!",null,null,null,0,0,0,0,0,0]
["",null,null,null,null,null,null,null,"","",null,"","","Let op! Ongeldige gegevens ingevoerd!",null,null,null,0,0,0,0,0,0]
["",null,null,null,null,null,null,null,"","",null,"","","Let op! Ongeldige gegevens ingevoerd!",null,null,null,0,0,0,0,0,0]
["",null,null,null,null,null,null,null,"","",null,"","","Let op! Ongeldige gegevens ingevoerd!",null,null,null,0,0,0,0,0,0]
["",null,null,null,null,null,null,null,"","",null,"","","Let op! Ongeldige gegevens ingevoerd!",null,null,null,0,0,0,0,0,0]
["",null,null,null,null,null,null,null,"","",null,"","","Let op! Ongeldige gegevens ingevoerd!",null,null,null,0,0,0,0,0,0]
["",null,null,null,null,null,null,null,"","",null,"","","Let op! Ongeldige gegevens ingevoerd!",null,null,null,0,0,0,0,0,0]
["",null,null,null,null,null,null,null,"","",null,"","","Let op! Ongeldige gegevens ingevoerd!",null,null,null,0,0,0,0,0,0]
["",null,null,null,null,null,null,null,"","",null,"","","Let op! Ongeldige gegevens ingevoerd!",null,null,null,0,0,0,0,0,0]
["",null,null,null,null,null,null,null,"","",null,"","","Let op! Ongeldige gegevens ingevoerd!",null,null,null,0,0,0,0,0,0]
["",null,null,null,null,null,null,null,"","",null,"","","Let op! Ongeldige gegevens ingevoerd!",null,null,null,0,0,0,0,0,0]
{"$rows_left_out":3584}
{"sheet":"Berekening","index":4,"n_rows":25,"n_cols":9,"rows_kept":25,"cut":false,"hidden":true,"merged":[]}
["Rekendatum:",{"$f":"rekdat","v":"00:00:00"},{"$f":"IF(B1<Variabelen!B21,0,1)","v":0},null,null,"Engelse variant:","Commence Date",{"$f":"Commencedate","v":"00:00:00"},{"$f":"IF(H1<Variabelen!B21,0,1)","v":0}]
[]
[]
[{"$f":"'Invoer en Uitvoer'!B5","v":"Naam deelnemer:"},{"$f":"'Invoer en Uitvoer'!C5","v":0},null,null,null,null,{"$f":"'Input and Output'!B5","v":"Name participant:"},{"$f":"'Input and Output'!C5","v":0}]
[{"$f":"'Invoer en Uitvoer'!B6","v":"Pensioennr deelnemer:"},{"$f":"'Invoer en Uitvoer'!C6","v":0},null,null,null,null,{"$f":"'Input and Output'!B6","v":"Pension number participant:"},{"$f":"'Input and Output'!C6","v":0}]
[{"$f":"'Invoer en Uitvoer'!B7","v":"Geboortedatum deelnemer:"},{"$f":"'Invoer en Uitvoer'!C7","v":"00:00:00"},{"$f":"IF(AND(B6>=Variabelen!D19,B6<=Variabelen!D20),1,0)","v":0},null,null,null,{"$f":"'Input and Output'!B7","v":"Date of birth participant:"},{"$f":"'Input and Output'!C7","v":"00:00:00"},{"$f":"IF(AND(H6>=Variabelen!D19,H6<=Variabelen!D20),1,0)","v":0}]
[{"$f":"'Invoer en Uitvoer'!B8","v":"Geboortedatum partner:"},{"$f":"'Invoer en Uitvoer'!C8","v":"00:00:00"},{"$f":"IF(AND(B7>=Variabelen!B19,B7<=Variabelen!B20),1,0)","v":0},null,null,null,{"$f":"'Input and Output'!B8","v":"Date of birth partner:"},{"$f":"'Input and Output'!C8","v":"00:00:00"},{"$f":"IF(AND(H7>=Variabelen!B19,H7<=Variabelen!B20),1,0)","v":0}]
[{"$f":"'Invoer en Uitvoer'!B9","v":"Verzekerd bedrag:"},{"$f":"'Invoer en Uitvoer'!C9","v":0},null,null,null,null,{"$f":"'Input and Output'!B9","v":"Insured amount:"},{"$f":"'Input and Output'!C9","v":0}]
["b_Verzekerd bedrag:",{"$f":"IF(ISNUMBER(MATCH(B8,Variabelen!B15:B17,0)),1,0)","v":0},{"$f":"IF(ISNUMBER(MATCH(B8,Variabelen!B15:B17,0)),1,0)","v":0},null,null,null,"Insured amount:",{"$f":"IF(ISNUMBER(MATCH(H8,Variabelen!B15:B17,0)),1,0)","v":0},{"$f":"IF(ISNUMBER(MATCH(H8,Variabelen!B15:B17,0)),1,0)","v":0}]
[]
[]
["Burgerlijke leeftijd deelnemer op 1 januari:",{"$f":"YEAR(B1)-YEAR(B6)-IF(AND(MONTH(B6)=1,DAY(B6)=1),0,1)","v":-1},null,null,null,null,"Age participant on the 1st of januari:",{"$f":"YEAR(H1)-YEAR(H6)-IF(AND(MONTH(H6)=1,DAY(H6)=1),0,1)","v":-1}]
["Burgerlijke leeftijd partner op 1 januari:",{"$f":"YEAR(B1)-YEAR(B7)-IF(AND(MONTH(B7)=1,DAY(B7)=1),0,1)","v":-1},null,null,null,null,"Age partner on the 1st of januari:",{"$f":"YEAR(H1)-YEAR(H7)-IF(AND(MONTH(H7)=1,DAY(H7)=1),0,1)","v":-1}]
[]
["factor koopsom (leeftijd partner)",{"$f":"IFERROR(VLOOKUP(B13,Variabelen!$A$25:$E$90,2,0),0)","v":0},null,null,null,null,"factor purchase price (age partner)",{"$f":"IFERROR(VLOOKUP(H13,Variabelen!$A$25:$E$90,2,0),0)","v":0}]
["factor premie (leeftijd deelnemer)",{"$f":"VLOOKUP(B12,Variabelen!$A$25:$E$90,3,0)","v":{"$error":"#N/A"}},null,null,null,null,"factor purchase price (age participant)",{"$f":"VLOOKUP(H12,Variabelen!$A$25:$E$90,3,0)","v":{"$error":"#N/A"}}]
[]
["OVL risicokapitaal:",{"$f":"B15*B8","v":0},null,null,null,null,"Death risk capital:",{"$f":"H15*H8","v":0}]
["OVL risicokapitaal / 1000:",{"$f":"B18/1000","v":0},null,null,null,null,"Death risk capital / 1000:",{"$f":"H18/1000","v":0}]
[null,null,{"$f":"C6*C7*C9","v":0},null,null,null,null,null,{"$f":"I6*I7*I9","v":0}]
[]
[]
["Premie per jaar",{"$f":"B19*B16*C20","v":{"$error":"#N/A"}},null,null,null,null,"Gross premium per year:",{"$f":"H19*H16*I20","v":{"$error":"#N/A"}}]
["Premie per maand",{"$f":"(B23/12)*C20","v":{"$error":"#N/A"}},null,null,null,null,"Gross premium per month:",{"$f":"(H23/12)*I20","v":{"$error":"#N/A"}}]
["Premie per 4wk",{"$f":"(B23/13)*C20","v":{"$error":"#N/A"}},null,null,null,null,"Gross premium per 4 weeks:",{"$f":"(H23/13)*I20","v":{"$error":"#N/A"}}]

{"sheet":"Legaliteit","index":5,"n_rows":25,"n_cols":2,"rows_kept":25,"cut":false,"hidden":true,"merged":[]}
["Dit tabblad wordt verborgen"]
["Op het tabblad Legaliteit komen de toegestane paden te staan"]
["Staat de sheet op een andere locatie dan worden de uitkomsten met nul vermenigvuldigd"]
[]
["Naam sheet: ","PME_ANW Premie berekening_2025 versie 1.0"]
[]
[]
["Toegestane locaties"]
["S:\\Pensioenuitvoering_Rekensheets\\Algemene rekensheets\\",{"$f":"A9&\"[\"&$B$5&\".xlsm]Legaliteit\"","v":"S:\\Pensioenuitvoering_Rekensheets\\Algemene rekensheets\\[PME_ANW Premie berekening_2025 versie 1.0.xlsm]Legaliteit"}]
["S:\\Deelnemersdesk_Testversies_rekensheets_Seniordesk\\Algemeen\\",{"$f":"A10&\"[\"&$B$5&\".xlsm]Legaliteit\"","v":"S:\\Deelnemersdesk_Testversies_rekensheets_Seniordesk\\Algemeen\\[PME_ANW Premie berekening_2025 versie 1.0.xlsm]Legaliteit"}]
["S:\\Deelnemersdesk_Testversies_rekensheets_Seniordesk\\PME\\","S:\\Deelnemersdesk_Testversies_rekensheets_Seniordesk\\PME\\[PME_ANW Premie berekening_2025 versie 1.0.xlsm]Legaliteit"]
["S:\\Pensioenuitvoering_Rekensheets\\PME\\","S:\\Pensioenuitvoering_Rekensheets\\PME\\[PME_ANW Premie berekening_2025 versie 1.0.xlsm]Legaliteit"]
["S:\\Pensioenuitvoering_rekensheets_pme\\","S:\\Pensioenuitvoering_rekensheets_pme\\[PME_ANW Premie berekening_2025 versie 1.0.xlsm]Legaliteit"]
["X:\\Finance\\Actuariaat\\Fondsen\\PME\\Rekensheets en berekeningen\\Individuele berekeningen\\ANW premie\\",{"$f":"A14&\"[\"&$B$5&\".xlsm]Legaliteit\"","v":"X:\\Finance\\Actuariaat\\Fondsen\\PME\\Rekensheets en berekeningen\\Individuele berekeningen\\ANW premie\\[PME_ANW Premie berekening_2025 versie 1.0.xlsm]Legaliteit"}]
["X:\\PenI\\PME\\003 Reglementen\\Premie Rekensheets","X:\\PenI\\PME\\003 Reglementen\\Premie Rekensheets[PME_ANW Premie berekening_2025 versie 1.0.xlsm]Legaliteit"]
["S:\\Pensioenuitvoering_Rekensheets\\PME\\archief\\","S:\\Pensioenuitvoering_Rekensheets\\PME\\archief\\[PME_ANW Premie berekening_2025 versie 1.0.xlsm]Legaliteit"]
["S:\\Deelnemersdesk_PME\\","S:\\Deelnemersdesk_PME\\[PME_ANW Premie berekening_2025 versie 1.0.xlsm]Legaliteit"]
["S:\\Pensioenuitvoering_Rekensheets\\PME\\Obbing.t\\Testmap\\","S:\\Pensioenuitvoering_Rekensheets\\PME\\Obbing.t\\Testmap\\[PME_ANW Premie berekening_2025 versie 1.0.xlsm]Legaliteit"]
["S:\\Pensioenuitvoering_Rekensheets\\PME\\Dorren.m\\Testmap\\","S:\\Pensioenuitvoering_Rekensheets\\PME\\Dorren.m\\Testmap\\[PME_ANW Premie berekening_2025 versie 1.0.xlsm]Legaliteit"]
["S:\\Pensioenuitvoering_rekensheets_pme\\Obbing.t\\Testmap\\","S:\\Pensioenuitvoering_rekensheets_pme\\Obbing.t\\Testmap\\[PME_ANW Premie berekening_2025 versie 1.0.xlsm]Legaliteit"]
["S:\\Pensioenuitvoering_rekensheets_pme\\Dorren.m\\Testmap\\","S:\\Pensioenuitvoering_rekensheets_pme\\Dorren.m\\Testmap\\[PME_ANW Premie berekening_2025 versie 1.0.xlsm]Legaliteit"]
[]
["Huidige Locatie ",{"$f":"CELL(\"bestandsnaam\",A1)","v":"C:\\Users\\bartelds.r\\AppData\\Local\\Microsoft\\Windows\\INetCache\\Content.Outlook\\OOZZ54FX\\[PME_ANW Premie berekening_2025 versie 1.0 - site.xlsm]Legaliteit"}]
[]
[null,{"$f":"IF(OR(B9=B23,B10=B23,B11=B23,B12=B23,B13=B23,B14=B23,B15=B23,B16=B23,B17=B23,B18=B23,B19=B23,B20=B23,B21=B23),1,0)*0+1","v":1}]

{"sheet":"Variabelen","index":6,"n_rows":816,"n_cols":12,"rows_kept":816,"cut":false,"hidden":true,"merged":[]}
["PME"]
["Bron: "]
["versienummer:",1,null,null,null,null,"AOW Leeftijd"]
["datum:","2024-11-20",null,null,null,null,"Geboren uiterlijk","AOW-leeftijd","Aanvangsleeftijd",null,"Geboortedatum","AOW"]
["door: ","Ferry Goike",null,null,null,null,"2023-12-31",67.25,17,null,"1900-01-01",{"$f":"H16","v":65}]
["review:",null,null,null,null,null,"1960-12-31",67,17,null,{"$f":"G16+1","v":"1948-01-01"},{"$f":"H15","v":65.083333333333329}]
[null,null,null,null,null,null,"1957-02-28",66.8333333333333,16.8333333333333,null,{"$f":"G15+1","v":"1948-12-01"},{"$f":"H14","v":65.166666666666671}]
[null,null,null,null,null,null,"1956-05-31",66.5833333333333,16.5833333333333,null,{"$f":"G14+1","v":"1949-11-01"},{"$f":"H13","v":65.25}]
["Opslagen","excasso","solvabiliteit","pvi",null,null,"1955-08-31",66.333333333333329,16.333333333333329,null,{"$f":"G13+1","v":"1950-10-01"},{"$f":"H12","v":65.5}]
["2025-01-01",null,null,null,null,null,"1952-12-31",66,16,null,{"$f":"G12+1","v":"1951-07-01"},{"$f":"H11","v":65.75}]
[null,null,null,null,null,null,"1952-03-31",65.75,15.75,null,{"$f":"G11+1","v":"1952-04-01"},{"$f":"H10","v":66}]
[null,null,null,null,null,null,"1951-06-30",65.5,15.5,null,{"$f":"G10+1","v":"1953-01-01"},{"$f":"H9","v":66.333333333333329}]
[null,null,null,null,null,null,"1950-09-30",65.25,15.25,null,{"$f":"G9+1","v":"1955-09-01"},{"$f":"H8","v":66.5833333333333}]
[null,null,null,null,null,null,"1949-10-31",65.166666666666671,15.166666666666671,null,{"$f":"G8+1","v":"1956-06-01"},{"$f":"H7","v":66.8333333333333}]
["Hoogte ANW optie 1",20400,null,{"$f":"YEAR(rekdat)","v":1900},null,null,"1948-11-30",65.083333333333329,15.083333333333329,null,{"$f":"G7+1","v":"1957-03-01"},{"$f":"H6","v":67}]
["Hoogte ANW optie 2",14800,null,null,null,null,"1947-12-31",65,15,null,{"$f":"G6+1","v":"1961-01-01"},{"$f":"H5","v":67.25}]
["Hoogte ANW optie 3",9200]
[null,null,null,null,null,null,null,null,null,null,"AOW-leeftijd partner",{"$f":"VLOOKUP('Invoer en Uitvoer'!$C$8,$K$6:$L$16,2,TRUE)","v":{"$error":"#N/A"}}]
["Maximale geboortedatum partner 2025",{"$f":"IF(GeboortedatumPartner<DATE(1948,1,1),DATE(YEAR(rekdat)-65,MONTH(rekdat)+1,DAY(rekdat)),IF(GeboortedatumPartner<DATE(1948,12,1),DATE(YEAR(rekdat)-65,MONTH(rekdat),DAY(rekdat)),IF(GeboortedatumPartner<DATE(1949,11,1),DATE(YEAR(rekdat)-65,MONTH(rekdat)-1,DAY(rekdat)),IF(GeboortedatumPartner<DATE(1950,10,1),DATE(YEAR(rekdat)-65,MONTH(rekdat)-2,DAY(rekdat)),IF(GeboortedatumPartner<DATE(1951,7,1),DATE(YEAR(rekdat)-65,MONTH(rekdat)-5,DAY(rekdat)),IF(GeboortedatumPartner<DATE(1952,4,1),DATE(YEAR(rekdat)-65,MONTH(rekdat)-8,DAY(rekdat)),IF(GeboortedatumPartner<DATE(1953,1,1),DATE(YEAR(rekdat)-66,MONTH(rekdat)+1,DAY(rekdat)),IF(GeboortedatumPartner<DATE(1955,9,1),DATE(YEAR(rekdat)-66,MONTH(rekdat)-3,DAY(rekdat)),IF(GeboortedatumPartner<DATE(1956,6,1),DATE(YEAR(rekdat)-66,MONTH(rekdat)-6,DAY(rekdat)),IF(GeboortedatumPartner<DATE(1957,3,1),DATE(YEAR(rekdat)-66,MONTH(rekdat)-9,DAY(rekdat)),IF(GeboortedatumPartner<DATE(1961,1,1),DATE(YEAR(rekdat)-67,MONTH(rekdat)+1,DAY(rekdat)),DATE(YEAR(rekdat)-67,MONTH(rekdat)-3,DAY(rekdat)))))))))))))","v":"3735-01-31"},"Maximale geboortedatum deelnemer 2025",{"$f":"DATE(YEAR(rekdat)-80,MONTH(rekdat),1)","v":"3720-01-01"},null,null,null,null,null,null,"AOW-leeftijd jaar",{"$f":"INT(L18)","v":{"$error":"#N/A"}}]
["Minimale geboortedatum partner 2025",{"$f":"DATE(YEAR(rekdat)-15,MONTH(rekdat),1)","v":"3785-01-01"},"Minimale geboortedatum deelnemer 2025",{"$f":"DATE(YEAR(rekdat)-18,MONTH(rekdat),1)","v":"3782-01-01"},null,null,null,null,null,null,"AOW-leeftijd maand",{"$f":"(L18-L19)*12","v":{"$error":"#N/A"}}]
["Minimale Ingangsdatum",{"$f":"DATE(YEAR(TODAY()),MONTH(TODAY())-3,1)","v":"2024-09-01"},null,null,null,null,null,null,null,null,"AOW-datum partner",{"$f":"DATE(YEAR('Invoer en Uitvoer'!$C$8)+Variabelen!$L$19,MONTH('Invoer en Uitvoer'!$C$8)+Variabelen!$L$20,1)","v":{"$error":"#N/A"}}]
["premie"]
[]
["leeftijd","koopsomtarief (gebaseerd op leeftijd partner op 1-1)","premietarief (gebaseerd op leeftijd deelnemer op 1-1)",null,"Leeftijd maanden","koopsomtarief (gebaseerd op leeftijd partner op 1-1)","premietarief (gebaseerd op leeftijd deelnemer op 1-1)"]
[15,32.558999999999997,0.04,null,180,{"$f":"VLOOKUP(ROUNDDOWN($E25/12,0),$A$25:$C$90,2,0)","v":32.558999999999997},{"$f":"VLOOKUP(ROUNDDOWN($E25/12,0),$A$25:$C$90,3,0)","v":0.04}]
[16,32.226999999999997,0.06,null,181,{"$f":"VLOOKUP(ROUNDDOWN($E26/12,0),$A$25:$C$90,2,0)","v":32.558999999999997},{"$f":"VLOOKUP(ROUNDDOWN($E26/12,0),$A$25:$C$90,3,0)","v":0.04}]
[17,31.888999999999999,0.06,null,182,32.558999999999997,0.04]
[18,31.544,0.08,null,183,32.558999999999997,0.04]
[19,31.190999999999999,0.09,null,184,32.558999999999997,0.04]
[20,30.832000000000001,0.1,null,185,32.558999999999997,0.04]
[21,30.465,0.11,null,186,32.558999999999997,0.04]
[22,30.09,0.11,null,187,32.558999999999997,0.04]
[23,29.707000000000001,0.12,null,188,32.558999999999997,0.04]
[24,29.317,0.12,null,189,32.558999999999997,0.04]
[25,28.917999999999999,0.13,null,190,32.558999999999997,0.04]
[26,28.510999999999999,0.13,null,191,32.558999999999997,0.04]
[27,28.094999999999999,0.13,null,192,32.226999999999997,0.06]
[28,27.638000000000002,0.14000000000000001,null,193,32.226999999999997,0.06]
[29,27.137,0.15,null,194,32.226999999999997,0.06]
[30,26.693999999999999,0.15,null,195,32.226999999999997,0.06]
{"$rows_left_out":776}